Target
11-beta-hydroxysteroid dehydrogenase 1
Ligand
BDBM50313285
Substrate
Meas. Tech.
ChEMBL_617123 (CHEMBL1101381)
IC50
0.36±n/a nM
Citation
 Shah, UBoyle, CDChackalamannil, SBaker, HKowalski, TLee, JTerracina, GZhang, L Azabicyclic sulfonamides as potent 11beta-HSD1 inhibitors. Bioorg Med Chem Lett 20:1551-4 (2010)  
Target
Name:
11-beta-hydroxysteroid dehydrogenase 1
Synonyms:
11-DH 11-beta-Hydroxysteroid Dehydrogenase 1 (11-beta-HSD1) 11beta-HSD1A Corticosteroid 11-beta-dehydrogenase isozyme 1 (11-beta-HSD-1) Hsd11 | Hsd11b1
Type:
Enzyme
Mol. Mass.:
32369.70
Organism:
Mus musculus (mouse)
Description:
P50172
Residue:
292
  
Inhibitor
Name:
BDBM50313285
Synonyms:
(1S,4S)-2-(4-tert-butylphenylsulfonyl)-5-methyl-2,5-diazabicyclo[2.2.1]heptane | CHEMBL1081251
Type:
Small organic molecule
Emp. Form.:
C16H24N2O2S
Mol. Mass.:
308.439
SMILES:
CN1C[C@@H]2C[C@H]1CN2S(=O)(=O)c1ccc(cc1)C(C)(C)C
: