Target
Matrix metalloproteinase-9
Ligand
BDBM11328
Substrate
Meas. Tech.
ChEMBL_624094 (CHEMBL1103425)
IC50
130±n/a nM
Citation
 Nuti, ECasalini, FAvramova, SISantamaria, SFabbi, MFerrini, SMarinelli, LLa Pietra, VLimongelli, VNovellino, ECercignani, GOrlandini, ENencetti, SRossello, A Potent arylsulfonamide inhibitors of tumor necrosis factor-alpha converting enzyme able to reduce activated leukocyte cell adhesion molecule shedding in cancer cell models. J Med Chem 53:2622-35 (2010)  
Target
Name:
Matrix metalloproteinase-9
Synonyms:
67 kDa matrix metalloproteinase-9 92 kDa gelatinase CLG4B Gelatinase B MMP9 Matrix metalloproteinase 9 (MMP-9) Matrix metalloproteinase-9 (MMP9)
Type:
Enzyme
Mol. Mass.:
78452.28
Organism:
Homo sapiens (Human)
Description:
P14780
Residue:
707
  
Inhibitor
Name:
BDBM11328
Synonyms:
CHEMBL83508 N-hydroxy-2-[(4-methoxybenzene)sulfonamido]acetamide
Type:
Small organic molecule
Emp. Form.:
C9H12N2O5S
Mol. Mass.:
260.267
SMILES:
COc1ccc(cc1)S(=O)(=O)NCC(=O)NO
: