Target
Calcitonin gene-related peptide type 1 receptor
Ligand
BDBM50315401
Substrate
Meas. Tech.
ChEMBL_626017 (CHEMBL1106145)
Ki
0.023±n/a nM
Citation
 Stump, CABell, IMBednar, RAFay, JFGallicchio, SNHershey, JCJelley, RKreatsoulas, CMoore, ELMosser, SDQuigley, AGRoller, SASalvatore, CASharik, SSTheberge, CRZartman, CBKane, SAGraham, SLSelnick, HGVacca, JPWilliams, TM Identification of potent, highly constrained CGRP receptor antagonists. Bioorg Med Chem Lett 20:2572-6 (2010)  
Target
Name:
Calcitonin gene-related peptide type 1 receptor
Synonyms:
Adrenomedullin receptor AM1; CALCRL/RAMP2 CALRL_HUMAN CGRP type 1 receptor mRNA Calcitonin gene-related peptide (CGRP) receptor Calcitonin receptor-like receptor Human CL receptor
Type:
Enzyme Catalytic Domain
Mol. Mass.:
52980.45
Organism:
Homo sapiens (Human)
Description:
Q16602
Residue:
461
  
Inhibitor
Name:
BDBM50315401
Synonyms:
(R)-1-((2'-oxo-1',2',6,8-tetrahydrospiro[cyclopenta[g]quinoline-7,3'-pyrrolo[2,3-b]pyridine]-2-yl)methyl)-1H-imidazo[1,5,4-de]quinoxaline-2,5(4H,6H)-dione | CHEMBL1092882
Type:
Small organic molecule
Emp. Form.:
C28H20N6O3
Mol. Mass.:
488.4968
SMILES:
O=C1Nc2ncccc2[C@]11Cc2cc3ccc(Cn4c5cccc6NC(=O)Cn(c56)c4=O)nc3cc2C1
: