Target
Adenosine receptor A1
Ligand
BDBM50315599
Substrate
Meas. Tech.
ChEMBL_627566 (CHEMBL1113572)
Ki
8740±n/a nM
Citation
 Pastorin, GFederico, SPaoletta, SCorradino, MCateni, FCacciari, BKlotz, KNGao, ZGJacobson, KASpalluto, GMoro, S Synthesis and pharmacological characterization of a new series of 5,7-disubstituted-[1,2,4]triazolo[1,5-a][1,3,5]triazine derivatives as adenosine receptor antagonists: A preliminary inspection of ligand-receptor recognition process. Bioorg Med Chem 18:2524-36 (2010)  
Target
Name:
Adenosine receptor A1
Synonyms:
AA1R_RAT ADENOSINE A1 high Adenosine A1 receptor (A1) Adenosine receptors A1 | Adora1
Type:
Protein
Mol. Mass.:
36704.13
Organism:
Rattus norvegicus (rat)
Description:
Residue:
326
  
Inhibitor
Name:
BDBM50315599
Synonyms:
5-Dimethylamino-2-(2-furyl)-7-[4-(methoxyphenyl)-acetyl]amino-[1,2,4]triazolo[1,5-a]-[1,3,5]triazine | CHEMBL1089463
Type:
Small organic molecule
Emp. Form.:
C19H19N7O3
Mol. Mass.:
393.3993
SMILES:
COc1ccc(CC(=O)Nc2nc(nc3nc(nn23)-c2ccco2)N(C)C)cc1
: