Target
Glutamate receptor 1
Ligand
BDBM50002369
Substrate
Meas. Tech.
ChEMBL_628001 (CHEMBL1105522)
EC50
23000±n/a nM
Citation
 Fleming, JJEngland, PM Developing a complete pharmacology for AMPA receptors: a perspective on subtype-selective ligands. Bioorg Med Chem 18:1381-7 (2010)  
Target
Name:
Glutamate receptor 1
Synonyms:
AMPA-selective glutamate receptor 1 GluA1 GluR-A Glur1 Gria1
Type:
Protein
Mol. Mass.:
101583.91
Organism:
Rattus norvegicus (Rat)
Description:
P19490
Residue:
907
  
Inhibitor
Name:
BDBM50002369
Synonyms:
(2S-(2alpha,3beta,4beta))-2-carboxy-4-(1-methylethenyl)-3-pyrrolidineacetic acid CHEMBL275040 Digensaeure Kainate L-alpha-kainic acid digenic acid | kainic acid
Type:
Small organic molecule
Emp. Form.:
C10H15NO4
Mol. Mass.:
213.2304
SMILES:
CC(=C)[C@H]1CN[C@@H]([C@H]1CC(O)=O)C(O)=O
: