Target
Leukotriene B4 receptor 1
Ligand
BDBM50317643
Substrate
Meas. Tech.
ChEMBL_632889 (CHEMBL1107471)
IC50
5.39±n/a nM
Target
Name:
Leukotriene B4 receptor 1
Synonyms:
BLT BLTR Chemoattractant receptor-like 1 GPR16 LTB4-R 1 Leukotriene B4 R1 Leukotriene B4 receptor 1 P2Y purinoceptor 7 | P2Y7
Type:
Enzyme Catalytic Domain
Mol. Mass.:
37582.68
Organism:
Homo sapiens (Human)
Description:
Q15722
Residue:
352
  
Inhibitor
Name:
BDBM50317643
Synonyms:
4-[3-[6-(3,5-Bis-benzo[1,3]dioxol-5-yl-phenoxy)-hexyl]-2-(2-carboxy-ethyl)-phenoxy]-butyric acid | CHEMBL1099328
Type:
Small organic molecule
Emp. Form.:
C39H40O10
Mol. Mass.:
668.7289
SMILES:
OC(=O)CCCOc1cccc(CCCCCCOc2cc(cc(c2)-c2ccc3OCOc3c2)-c2ccc3OCOc3c2)c1CCC(O)=O
: