Target
Voltage-dependent L-type calcium channel subunit alpha-1C
Ligand
BDBM50317813
Substrate
Meas. Tech.
ChEMBL_629725 (CHEMBL1121085)
IC50
10±n/a nM
Citation
 Chang, CCCao, SKang, SKai, LTian, XPandey, PDunne, SFLuan, CHSurmeier, DJSilverman, RB Antagonism of 4-substituted 1,4-dihydropyridine-3,5-dicarboxylates toward voltage-dependent L-type Ca2+ channels Ca V 1.3 and Ca V 1.2. Bioorg Med Chem 18:3147-58 (2010)  
Target
Name:
Voltage-dependent L-type calcium channel subunit alpha-1C
Synonyms:
CAC1C_RABIT CACN2 CACNL1A1 L-type calcium channel alpha 1C/beta 2A | Voltage-gated L-type calcium channel alpha-1C subunit
Type:
PROTEIN
Mol. Mass.:
242793.78
Organism:
Oryctolagus cuniculus
Description:
ChEMBL_42776
Residue:
2171
  
Inhibitor
Name:
BDBM50317813
Synonyms:
3-ethyl 5-(2-(methacryloyloxy)ethyl)2,6-dimethyl-4-(3-nitrophenyl)-1,4-dihydropyridine-3,5-dicarboxylate | CHEMBL1097880
Type:
Small organic molecule
Emp. Form.:
C23H26N2O8
Mol. Mass.:
458.4611
SMILES:
CCOC(=O)C1C(C(C(=O)OCCOC(=O)C(C)=C)=C(C)N=C1C)c1cccc(c1)[N+]([O-])=O
: