Target
Voltage-dependent L-type calcium channel subunit alpha-1C
Ligand
BDBM50317829
Substrate
Meas. Tech.
ChEMBL_629725 (CHEMBL1121085)
IC50
19±n/a nM
Citation
 Chang, CCCao, SKang, SKai, LTian, XPandey, PDunne, SFLuan, CHSurmeier, DJSilverman, RB Antagonism of 4-substituted 1,4-dihydropyridine-3,5-dicarboxylates toward voltage-dependent L-type Ca2+ channels Ca V 1.3 and Ca V 1.2. Bioorg Med Chem 18:3147-58 (2010)  
Target
Name:
Voltage-dependent L-type calcium channel subunit alpha-1C
Synonyms:
CAC1C_RABIT CACN2 CACNL1A1 L-type calcium channel alpha 1C/beta 2A | Voltage-gated L-type calcium channel alpha-1C subunit
Type:
PROTEIN
Mol. Mass.:
242793.78
Organism:
Oryctolagus cuniculus
Description:
ChEMBL_42776
Residue:
2171
  
Inhibitor
Name:
BDBM50317829
Synonyms:
3-(2-(2-chlorophenoxy)ethyl)5-methyl 2,6-dimethyl-4-(3-nitrophenyl)-1,4-dihydropyridine-3,5-dicarboxylate | CHEMBL1096843
Type:
Small organic molecule
Emp. Form.:
C24H23ClN2O7
Mol. Mass.:
486.902
SMILES:
COC(=O)C1C(C(C(=O)OCCOc2ccccc2Cl)=C(C)N=C1C)c1cccc(c1)[N+]([O-])=O
: