Target
Voltage-dependent L-type calcium channel subunit alpha-1C
Ligand
BDBM50317840
Substrate
Meas. Tech.
ChEMBL_629725 (CHEMBL1121085)
IC50
15±n/a nM
Citation
 Chang, CCCao, SKang, SKai, LTian, XPandey, PDunne, SFLuan, CHSurmeier, DJSilverman, RB Antagonism of 4-substituted 1,4-dihydropyridine-3,5-dicarboxylates toward voltage-dependent L-type Ca2+ channels Ca V 1.3 and Ca V 1.2. Bioorg Med Chem 18:3147-58 (2010)  
Target
Name:
Voltage-dependent L-type calcium channel subunit alpha-1C
Synonyms:
CAC1C_RABIT CACN2 CACNL1A1 L-type calcium channel alpha 1C/beta 2A | Voltage-gated L-type calcium channel alpha-1C subunit
Type:
PROTEIN
Mol. Mass.:
242793.78
Organism:
Oryctolagus cuniculus
Description:
ChEMBL_42776
Residue:
2171
  
Inhibitor
Name:
BDBM50317840
Synonyms:
CHEMBL1099188 | diethyl 4-(2,3-difluorophenyl)-2,6-dimethyl-1,4-dihydropyridine-3,5-dicarboxylate
Type:
Small organic molecule
Emp. Form.:
C19H21F2NO4
Mol. Mass.:
365.3711
SMILES:
CCOC(=O)C1C(C(C(=O)OCC)=C(C)N=C1C)c1cccc(F)c1F
: