Target
Beta-2 adrenergic receptor
Ligand
BDBM50151720
Substrate
Meas. Tech.
ChEMBL_632382 (CHEMBL1115587)
IC50
0.40±n/a nM
Citation
 Baur, FBeattie, DBeer, DBentley, DBradley, MBruce, ICharlton, SJCuenoud, BErnst, RFairhurst, RAFaller, BFarr, DKeller, TFozard, JRFullerton, JGarman, SHatto, JHayden, CHe, HHowes, CJanus, DJiang, ZLewis, CLoeuillet-Ritzler, FMoser, HReilly, JSteward, ASykes, DTedaldi, LTrifilieff, ATweed, MWatson, SWissler, EWyss, D The identification of indacaterol as an ultralong-acting inhaled beta2-adrenoceptor agonist. J Med Chem 53:3675-84 (2010)  
Target
Name:
Beta-2 adrenergic receptor
Synonyms:
ADRB2_CAVPO adrenergic Beta2
Type:
Enzyme Catalytic Domain
Mol. Mass.:
46993.24
Organism:
GUINEA PIG
Description:
adrenergic Beta2 ADRB2 GUINEA PIG::Q8K4Z4
Residue:
418
  
Inhibitor
Name:
BDBM50151720
Synonyms:
ARFORMOTEROL TARTRATE CHEMBL605993 FORMOTEROL FUMARATE N-(2-Hydroxy-5-{1-hydroxy-2-[2-(4-methoxy-phenyl)-1-methyl-ethylamino]-ethyl}-phenyl)-formamide Symbicort | cid_9912089
Type:
Small organic molecule
Emp. Form.:
C19H24N2O4
Mol. Mass.:
344.4049
SMILES:
COc1ccc(C[C@@H](C)NC[C@H](O)c2ccc(O)c(NC=O)c2)cc1
: