Target
Histamine H3 receptor
Ligand
BDBM50319528
Substrate
Meas. Tech.
ChEMBL_634304 (CHEMBL1120717)
Ki
0.16±n/a nM
Citation
 Liu, HAltenbach, RJDiaz, GJManelli, AMMartin, RLMiller, TREsbenshade, TABrioni, JDCowart, MD In vitro studies on a class of quinoline containing histamine H3 antagonists. Bioorg Med Chem Lett 20:3295-300 (2010)  
Target
Name:
Histamine H3 receptor
Synonyms:
G-protein coupled receptor 97 HH3R HRH3 Histamine H3 receptor (H3) Histamine receptor (H3 and H4)
Type:
G Protein-Coupled Receptor (GPCR)
Mol. Mass.:
48691.47
Organism:
Homo sapiens (Human)
Description:
Binding assays were using CHO cells stably expressing hH3R receptors.
Residue:
445
  
Inhibitor
Name:
BDBM50319528
Synonyms:
(R)-2-(1,5-dimethyl-1H-pyrazol-4-yl)-6-(2-(2-methylpyrrolidin-1-yl)ethyl)quinoline | CHEMBL1084827
Type:
Small organic molecule
Emp. Form.:
C21H26N4
Mol. Mass.:
334.4579
SMILES:
C[C@@H]1CCCN1CCc1ccc2nc(ccc2c1)-c1cnn(C)c1C
: