Target
Vasopressin V1a receptor
Ligand
BDBM50319782
Substrate
Meas. Tech.
ChEMBL_634856 (CHEMBL1120488)
Ki
0.6±n/a nM
Citation
 Crombie, ALAntrilli, TMCampbell, BACrandall, DLFailli, AAHe, YKern, JCMoore, WJNogle, LMTrybulski, EJ Synthesis and evaluation of azabicyclo[3.2.1]octane derivatives as potent mixed vasopressin antagonists. Bioorg Med Chem Lett 20:3742-5 (2010)  
Target
Name:
Vasopressin V1a receptor
Synonyms:
AVPR V1a AVPR1A V1AR_HUMAN VASOPRESSIN V1A Vasopressin V1 receptor Vasopressin receptor
Type:
Receptor
Mol. Mass.:
46820.18
Organism:
Homo sapiens (Human)
Description:
P37288
Residue:
418
  
Inhibitor
Name:
BDBM50319782
Synonyms:
(2-methoxy-2',6'-dimethylbiphenyl-4-yl)((1S,5R)-1,3,3-trimethyl-6-azabicyclo[3.2.1]octan-6-yl)methanone | CHEMBL1083731
Type:
Small organic molecule
Emp. Form.:
C26H33NO2
Mol. Mass.:
391.5457
SMILES:
COc1cc(ccc1-c1c(C)cccc1C)C(=O)N1C[C@]2(C)C[C@H]1CC(C)(C)C2
: