Target
Aldo-keto reductase family 1 member B10
Ligand
BDBM16312
Substrate
Meas. Tech.
ChEMBL_640033 (CHEMBL1174247)
IC50
9600±n/a nM
Citation
 Endo, SMatsunaga, TKuwata, KZhao, HTEl-Kabbani, OKitade, YHara, A Chromene-3-carboxamide derivatives discovered from virtual screening as potent inhibitors of the tumour maker, AKR1B10. Bioorg Med Chem 18:2485-90 (2010)  
Target
Name:
Aldo-keto reductase family 1 member B10
Synonyms:
AK1BA_HUMAN AKR1B11 ARP Aldo-keto reductase family 1 member B10 (AKR1B10) Aldose reductase-like SI reductase hARP
Type:
Protein
Mol. Mass.:
36024.67
Organism:
Homo sapiens (Human)
Description:
O60218. 1ZUA; 4JII; 4GQ0
Residue:
316
  
Inhibitor
Name:
BDBM16312
Synonyms:
(4S)-6-fluoro-2,3-dihydrospiro[1-benzopyran-4,4'-imidazolidine]-2',5'-dione Sorbinil
Type:
Small organic molecule
Emp. Form.:
C11H9FN2O3
Mol. Mass.:
236.1992
SMILES:
Fc1ccc2OCC[C@]3(NC(=O)NC3=O)c2c1
: