Target
Cytochrome P450 1A1
Ligand
BDBM23418
Substrate
Meas. Tech.
ChEMBL_652514 (CHEMBL1225717)
IC50
2786±n/a nM
Citation
 Takemura, HItoh, TYamamoto, KSakakibara, HShimoi, K Selective inhibition of methoxyflavonoids on human CYP1B1 activity. Bioorg Med Chem 18:6310-5 (2010)  
Target
Name:
Cytochrome P450 1A1
Synonyms:
CP1A1_HUMAN CYPIA1 Cytochrome P450 1A1 P450 form 6 P450-P1
Type:
Protein
Mol. Mass.:
58177.23
Organism:
Homo sapiens (Human)
Description:
P04798
Residue:
512
  
Inhibitor
Name:
BDBM23418
Synonyms:
(2S)-5,7-dihydroxy-2-(3-hydroxy-4-methoxyphenyl)-3,4-dihydro-2H-1-benzopyran-4-one Hesperitin
Type:
flavanone
Emp. Form.:
C16H14O6
Mol. Mass.:
302.2788
SMILES:
COc1ccc(cc1O)[C@@H]1CC(=O)c2c(O)cc(O)cc2O1
: