Target
Beta-lactamase
Ligand
BDBM50021954
Substrate
Meas. Tech.
ChEMBL_659142 (CHEMBL1247087)
IC50
370±n/a nM
Citation
 Kotsakis, SDPapagiannitsis, CCTzelepi, ELegakis, NJMiriagou, VTzouvelekis, LS GES-13, a beta-lactamase variant possessing Lys-104 and Asn-170 in Pseudomonas aeruginosa. Antimicrob Agents Chemother 54:1331-3 (2010)  
Target
Name:
Beta-lactamase
Synonyms:
Beta-lactamase GES-13
Type:
PROTEIN
Mol. Mass.:
31212.74
Organism:
Pseudomonas aeruginosa
Description:
ChEMBL_659142
Residue:
287
  
Inhibitor
Name:
BDBM50021954
Synonyms:
(2S,5R)-3,3-Dimethyl-4,4,7-trioxo-4lambda*6*-thia-1-aza-bicyclo[3.2.0]heptane-2-carboxylic acid 3,3-Dimethyl-4,4,7-trioxo-4lambda*6*-thia-1-aza-bicyclo[3.2.0]heptane-2-carboxylic acid CHEMBL403 SULBACTAM US20230322715, Compound ALK-09 | US9120808, Sulbactam sodium salt
Type:
Small organic molecule
Emp. Form.:
C8H11NO5S
Mol. Mass.:
233.242
SMILES:
CC1(C)[C@@H](N2[C@@H](CC2=O)S1(=O)=O)C(O)=O
: