Target
Caspase-7
Ligand
BDBM10246
Substrate
Meas. Tech.
ChEMBL_659716 (CHEMBL1246138)
IC50
59.1±n/a nM
Citation
 Newton, ASGlória, PMGonçalves, LMdos Santos, DJMoreira, RGuedes, RCSantos, MM Synthesis and evaluation of vinyl sulfones as caspase-3 inhibitors. A structure-activity study. Eur J Med Chem 45:3858-63 (2010)  
Target
Name:
Caspase-7
Synonyms:
Apoptotic protease Mch-3 CASP7 CMH-1 MCH3 | caspase 7, apoptosis-related cysteine peptidase
Type:
Enzyme
Mol. Mass.:
34273.91
Organism:
Homo sapiens (Human)
Description:
P55210
Residue:
303
  
Inhibitor
Name:
BDBM10246
Synonyms:
(4S)-4-{[(1S)-1-{[(2S)-1-carboxy-3-oxopropan-2-yl]carbamoyl}-2-methylpropyl]carbamoyl}-4-[(3S)-3-acetamido-3-formamidopropanoic acid]butanoic acid CHEMBL417149
Type:
Small organic molecule
Emp. Form.:
C20H30N4O11
Mol. Mass.:
502.4724
SMILES:
CC(C)[C@H](NC(=O)[C@H](CCC(O)=O)NC(=O)[C@H](CC(O)=O)NC(C)=O)C(=O)N[C@@H](CC(O)=O)C=O
: