Target
Dihydrofolate reductase
Ligand
BDBM18793
Substrate
Meas. Tech.
ChEMBL_666431 (CHEMBL1260235)
Ki
7.7±n/a nM
Citation
 Nzila, ARottmann, MChitnumsub, PKiara, SMKamchonwongpaisan, SManeeruttanarungroj, CTaweechai, SYeung, BKGoh, ALakshminarayana, SBZou, BWong, JMa, NLWeaver, MKeller, THDartois, VWittlin, SBrun, RYuthavong, YDiagana, TT Preclinical evaluation of the antifolate QN254, 5-chloro- N'6'-(2,5-dimethoxy-benzyl)-quinazoline-2,4,6-triamine, as an antimalarial drug candidate. Antimicrob Agents Chemother 54:2603-10 (2010)  
Target
Name:
Dihydrofolate reductase
Synonyms:
DHFR Dihydrofolate reductase (DHFR) | Tetrahydrofolate dehydrogenase
Type:
Enzyme
Mol. Mass.:
21453.99
Organism:
Homo sapiens (Human)
Description:
Recombinant human DHFR.
Residue:
187
  
Inhibitor
Name:
BDBM18793
Synonyms:
6,6-dimethyl-1-[3-(2,4,5-trichlorophenoxy)propoxy]-1,6-dihydro-1,3,5-triazine-2,4-diamine WR99210
Type:
Small organic molecule
Emp. Form.:
C14H18Cl3N5O2
Mol. Mass.:
394.684
SMILES:
CC1(C)N=C(N)N=C(N)N1OCCCOc1cc(Cl)c(Cl)cc1Cl
: