Target
Muscarinic acetylcholine receptor M1
Ligand
BDBM50258439
Substrate
Meas. Tech.
ChEMBL_664699 (CHEMBL1260585)
EC50
6100±n/a nM
Citation
 Bridges, TMKennedy, JPHopkins, CRConn, PJLindsley, CW Heterobiaryl and heterobiaryl ether derived M5 positive allosteric modulators. Bioorg Med Chem Lett 20:5617-22 (2010)  
Target
Name:
Muscarinic acetylcholine receptor M1
Synonyms:
ACM1_HUMAN Cholinergic receptor, muscarinic 1 | Cholinergic, muscarinic M1
Type:
Protein
Mol. Mass.:
51442.54
Organism:
Homo sapiens (Human)
Description:
P11229
Residue:
460
  
Inhibitor
Name:
BDBM50258439
Synonyms:
1-(4-bromobenzyl)indoline-2,3-dione CVD-0005886 VU0119498 | cid_3008304
Type:
Small organic molecule
Emp. Form.:
C15H10BrNO2
Mol. Mass.:
316.149
SMILES:
Brc1ccc(CN2C(=O)C(=O)c3ccccc23)cc1
: