Target
Protein kinase C eta type
Ligand
BDBM50327943
Substrate
Meas. Tech.
ChEMBL_665136 (CHEMBL1260399)
Ki
0.360000±n/a nM
Citation
 Yanagita, RCKamachi, HTanaka, KMurakami, ANakagawa, YTokuda, HNagai, HIrie, K Role of the phenolic hydroxyl group in the biological activities of simplified analogue of aplysiatoxin with antiproliferative activity. Bioorg Med Chem Lett 20:6064-6 (2010)  
Target
Name:
Protein kinase C eta type
Synonyms:
KPCL_HUMAN PKCL PRKCL Protein kinase C, PKC; classical/novel | nPKC-eta
Type:
Enzyme
Mol. Mass.:
77844.26
Organism:
Homo sapiens (Human)
Description:
The recombinant human PKC enzymes were produced using a baculovirus expression system in SF9 cells
Residue:
683
  
Inhibitor
Name:
BDBM50327943
Synonyms:
Aplysiatoxin | CHEMBL1256416
Type:
Small organic molecule
Emp. Form.:
C32H47BrO10
Mol. Mass.:
671.614
SMILES:
CO[C@@H](CC[C@H](C)[C@H]1O[C@@]23C[C@H](OC(=O)C[C@@H](OC(=O)C[C@](O)(O2)[C@H](C)CC3(C)C)[C@@H](C)O)[C@@H]1C)c1cc(O)ccc1Br
: