Target
11-beta-hydroxysteroid dehydrogenase type 2
Ligand
BDBM50329195
Substrate
Meas. Tech.
ChEMBL_674863 (CHEMBL1272436)
IC50
122±n/a nM
Citation
 Stanetty, CCzollner, LKoller, IShah, PGaware, RCunha, TDOdermatt, AJordis, UKosma, PClassen-Houben, D Synthesis of novel 3-amino and 29-hydroxamic acid derivatives of glycyrrhetinic acid as selective 11ß-hydroxysteroid dehydrogenase 2 inhibitors. Bioorg Med Chem 18:7522-41 (2010)  
Target
Name:
11-beta-hydroxysteroid dehydrogenase type 2
Synonyms:
11-DH2 11-beta-Hydroxysteroid Dehydrogenase 2 (11-beta-HSD2) 11-beta-hydroxysteroid dehydrogenase 2 11-beta-hydroxysteroid dehydrogenase type 2 (11-beta-HSD2) DHI2_HUMAN HSD11K SDR9C3
Type:
Enzyme
Mol. Mass.:
44141.72
Organism:
Homo sapiens (Human)
Description:
Purified recombinant human 11beta-HSD2.
Residue:
405
  
Inhibitor
Name:
BDBM50329195
Synonyms:
(2S,4aS,6aS,6bR,8aR,10S,12aS,12bR,14bR)-N,10-dihydroxy-2,4a,6a,6b,9,9,12a-heptamethyl-13-oxo-1,2,3,4,4a,5,6,6a,6b,7,8,8a,9,10,11,12,12a,12b,13,14b-icosahydropicene-2-carboxamide | CHEMBL1271303
Type:
Small organic molecule
Emp. Form.:
C30H47NO4
Mol. Mass.:
485.6985
SMILES:
CC1(C)[C@@H](O)CC[C@@]2(C)[C@H]1CC[C@]1(C)[C@@H]2C(=O)C=C2[C@@H]3C[C@](C)(CC[C@]3(C)CC[C@@]12C)C(=O)NO
: