Target
Polyunsaturated fatty acid lipoxygenase ALOX15
Ligand
BDBM50329329
Substrate
Meas. Tech.
ChEMBL_675412 (CHEMBL1273492)
IC50
<10.0±n/a nM
Citation
 Rai, GKenyon, VJadhav, ASchultz, LArmstrong, MJameson, JBHoobler, ELeister, WSimeonov, AHolman, TRMaloney, DJ Discovery of potent and selective inhibitors of human reticulocyte 15-lipoxygenase-1. J Med Chem 53:7392-404 (2010)  
Target
Name:
Polyunsaturated fatty acid lipoxygenase ALOX15
Synonyms:
15-Lipoxygenase-1 (15-LOX-1) Arachidonate 15-lipoxygenase LOG15 Reticulocyte 15-lipoxygenase-1 | Sphingosine 1-phosphate receptor 1 (S1P1)
Type:
Protein
Mol. Mass.:
74804.05
Organism:
Homo sapiens (Human)
Description:
Residue:
662
  
Inhibitor
Name:
BDBM50329329
Synonyms:
4-(5-(4-Chlorophenyl)-1,3,4-oxadiazol-2-ylthio)but-2-ynyl4-Fluorobenzoate | CHEMBL1270608
Type:
Small organic molecule
Emp. Form.:
C19H12ClFN2O3S
Mol. Mass.:
402.827
SMILES:
Fc1ccc(cc1)C(=O)OCC#CCSc1nnc(o1)-c1ccc(Cl)cc1
: