Target
Apoptosis regulator Bcl-2
Ligand
BDBM50329371
Substrate
Meas. Tech.
ChEMBL_675630 (CHEMBL1273938)
Kd
60000±n/a nM
Citation
 Petros, AMHuth, JROost, TPark, CMDing, HWang, XZhang, HNimmer, PMendoza, RSun, CMack, JWalter, KDorwin, SGramling, ELadror, URosenberg, SHElmore, SWFesik, SWHajduk, PJ Discovery of a potent and selective Bcl-2 inhibitor using SAR by NMR. Bioorg Med Chem Lett 20:6587-91 (2010)  
Target
Name:
Apoptosis regulator Bcl-2
Synonyms:
Apoptosis regulator Bcl-2 Protein BCL-2 BCL2_HUMAN | Bcl-2 Protein
Type:
Homodimer or heterodimer
Mol. Mass.:
26269.11
Organism:
Homo sapiens (Human)
Description:
P10415
Residue:
239
  
Inhibitor
Name:
BDBM50329371
Synonyms:
1-((4-chlorophenyl)(phenyl)methyl)-4-methylpiperazine CHEMBL22150 | chlorcyclizine
Type:
Small organic molecule
Emp. Form.:
C18H21ClN2
Mol. Mass.:
300.826
SMILES:
CN1CCN(CC1)C(c1ccccc1)c1ccc(Cl)cc1
: