Target
Hypoxia-inducible factor 1-alpha
Ligand
BDBM50008935
Substrate
Meas. Tech.
ChEMBL_675858 (CHEMBL1272616)
IC50
60±n/a nM
Citation
 Yewalkar, NDeore, VPadgaonkar, AManohar, SSahu, BKumar, PJalota-Badhwar, AJoshi, KSSharma, SKumar, S Development of novel inhibitors targeting HIF-1a towards anticancer drug discovery. Bioorg Med Chem Lett 20:6426-9 (2010)  
Target
Name:
Hypoxia-inducible factor 1-alpha
Synonyms:
BHLHE78 HIF-1-alpha, HIF-2-alpha HIF1A_HUMAN Hypoxia-inducible factor 1 alpha MOP1 von Hippel-Lindau disease tumor suppressor/Elongin-C/Elongin-B/HIF1A
Type:
Protein
Mol. Mass.:
92647.24
Organism:
Homo sapiens (Human)
Description:
Q16665
Residue:
826
  
Inhibitor
Name:
BDBM50008935
Synonyms:
(20S)-10-Dimethylaminomethyl-4-ethyl-4,9-dihydroxy-1,12-dihydro-4H-2-oxa-6,12a-diaza-dibenzo[b,h]fluorene-3,13-dione (S)-10-[(DIMETHYLAMINO)METHYL]-4-ETHYL-4,9-DIHYDROXY-1H-PYRANO[3'',4'':6,7]INOLIZINO[1,2-B]-QUINOLINE-3,14(4H,12H)-DIONE (S)-11-Dimethylaminomethyl-4-ethyl-4,9-dihydroxy-1,12-dihydro-4H-2-oxa-6,12a-diaza-dibenzo[b,h]fluorene-3,13-dione 10-Dimethylaminomethyl-4-ethyl-4,9-dihydroxy-1,12-dihydro-4H-2-oxa-6,12a-diaza-dibenzo[b,h]fluorene-3,13-dione (Topotecan) 10-dimethylaminomethyl-4-ethyl-4,9-dihydroxy-(4S)-3,4,12,14-tetrahydro-1H-pyrano[3'',4'':6,7]indolizino[1,2-b]quinoline-3,14-dione Hycamtin TOPOTECAN HYDROCHLORIDE | cid_60700
Type:
Small organic molecule
Emp. Form.:
C23H23N3O5
Mol. Mass.:
421.4458
SMILES:
CC[C@@]1(O)C(=O)OCc2c1cc1-c3nc4ccc(O)c(CN(C)C)c4cc3Cn1c2=O
: