Target
DNA gyrase subunit B
Ligand
BDBM50330321
Substrate
Meas. Tech.
ChEMBL_677263 (CHEMBL1279101)
IC50
>10000±n/a nM
Citation
 Anderle, CStieger, MBurrell, MReinelt, SMaxwell, APage, MHeide, L Biological activities of novel gyrase inhibitors of the aminocoumarin class. Antimicrob Agents Chemother 52:1982-90 (2008)  
Target
Name:
DNA gyrase subunit B
Synonyms:
DNA gyrase subunit B GYRB_ECOLI acrB gyrB hisU parA | pcbA
Type:
Enzyme Subunit
Mol. Mass.:
89941.28
Organism:
Escherichia coli (strain K12)
Description:
P0AES6
Residue:
804
  
Inhibitor
Name:
BDBM50330321
Synonyms:
CHEMBL1276306 | N-(7-((2R,3R,4S,5R)-3,4-dihydroxy-5-methoxy-6,6-dimethyltetrahydro-2H-pyran-2-yloxy)-4-hydroxy-8-methyl-2-oxo-2H-chromen-3-yl)benzamide
Type:
Small organic molecule
Emp. Form.:
C25H27NO9
Mol. Mass.:
485.4832
SMILES:
CO[C@@H]1[C@@H](O)[C@@H](O)[C@H](Oc2ccc3c(O)c(NC(=O)c4ccccc4)c(=O)oc3c2C)OC1(C)C
: