Target
VIM-1 protein
Ligand
BDBM50330325
Substrate
Meas. Tech.
ChEMBL_678224 (CHEMBL1280219)
IC50
9300±n/a nM
Citation
 Juan, CBeceiro, AGutiérrez, OAlbertí, SGarau, MPérez, JLBou, GOliver, A Characterization of the new metallo-beta-lactamase VIM-13 and its integron-borne gene from a Pseudomonas aeruginosa clinical isolate in Spain. Antimicrob Agents Chemother 52:3589-96 (2008)  
Target
Name:
VIM-1 protein
Synonyms:
Beta-lactamase VIM-1 Metallo-beta-lactamase VIM-1 VIM-1 VIM-1 metallo-beta-lactamase | VIM-1 protein
Type:
Enzyme Catalytic Domain
Mol. Mass.:
28014.53
Organism:
Pseudomonas aeruginosa
Description:
Residue:
266
  
Inhibitor
Name:
BDBM50330325
Synonyms:
2,2',2'',2'''-(ethane-1,2-diylbis(azanetriyl))tetraacetic acid Edetate [{2-[bis(carboxymethyl)amino]ethyl}(carboxymethyl)amino]acetic acid {[-(BIS-CARBOXYMETHYL-AMINO)-ETHYL]-CARBOXYMETHYL-AMINO}-ACETIC ACID {[2-(Bis-carboxymethyl-amino)-ethyl]-carboxymethyl-amino}-acetic acid(EDTA)
Type:
Small organic molecule
Emp. Form.:
C10H16N2O8
Mol. Mass.:
292.2426
SMILES:
OC(=O)CN(CCN(CC(O)=O)CC(O)=O)CC(O)=O
: