Target
Renin-1
Ligand
BDBM17950
Substrate
Meas. Tech.
ChEMBL_685608 (CHEMBL1285386)
IC50
4.5±n/a nM
Citation
 Webb, RLSchiering, NSedrani, RMaibaum, J Direct renin inhibitors as a new therapy for hypertension. J Med Chem 53:7490-520 (2010)  
Target
Name:
Renin-1
Synonyms:
Angiotensinogenase RENI1_MOUSE Ren-1 Renin | Renin-1
Type:
PROTEIN
Mol. Mass.:
44345.30
Organism:
Mus musculus
Description:
ChEMBL_685608
Residue:
402
  
Inhibitor
Name:
BDBM17950
Synonyms:
(2S,4S,5S,7S)-5-amino-N-(2-carbamoyl-2,2-dimethylethyl)-4-hydroxy-7-{[4-methoxy-3-(3-methoxypropoxy)phenyl]methyl}-8-methyl-2-(propan-2-yl)nonanamide Aliskiren CHEMBL1639 TEKTURNA
Type:
Small organic molecule
Emp. Form.:
C30H53N3O6
Mol. Mass.:
551.7583
SMILES:
COCCCOc1cc(C[C@@H](C[C@H](N)[C@@H](O)C[C@@H](C(C)C)C(=O)NCC(C)(C)C(N)=O)C(C)C)ccc1OC
: