Target
Aldo-keto reductase family 1 member C1
Ligand
BDBM50330423
Substrate
Meas. Tech.
ChEMBL_684679 (CHEMBL1285646)
Ki
96±n/a nM
Citation
 El-Kabbani, OScammells, PJDay, TDhagat, UEndo, SMatsunaga, TSoda, MHara, A Structure-based optimization and biological evaluation of human 20a-hydroxysteroid dehydrogenase (AKR1C1) salicylic acid-based inhibitors. Eur J Med Chem 45:5309-17 (2010)  
Target
Name:
Aldo-keto reductase family 1 member C1
Synonyms:
20-alpha-HSD AK1C1_HUMAN Aldo-keto reductase family 1 member C1 (AK1C1) Aldo-keto reductase family 1 member C1 (AKR1C1) DDH High-affinity hepatic bile acid-binding protein | Trans-1,2-dihydrobenzene-1,2-diol dehydrogenase
Type:
Enzyme
Mol. Mass.:
36793.97
Organism:
Homo sapiens (Human)
Description:
Recombinant AKR1C1 enzyme was expressed in E. coli.
Residue:
323
  
Inhibitor
Name:
BDBM50330423
Synonyms:
4'-tert-Butyl-5-chloro-4-hydroxybiphenyl-3-carboxylic acid | CHEMBL1277740
Type:
Small organic molecule
Emp. Form.:
C17H17ClO3
Mol. Mass.:
304.768
SMILES:
CC(C)(C)c1ccc(cc1)-c1cc(Cl)c(O)c(c1)C(O)=O
: