Target
Endochitinase A1
Ligand
BDBM50331836
Substrate
Meas. Tech.
ChEMBL_686888 (CHEMBL1291257)
IC50
>1000000±n/a nM
Citation
 Schüttelkopf, AWGros, LBlair, DEFrearson, JAvan Aalten, DMGilbert, IH Acetazolamide-based fungal chitinase inhibitors. Bioorg Med Chem 18:8334-40 (2010)  
Target
Name:
Endochitinase A1
Synonyms:
CHIA1_ASPFM chi1 | chiA1
Type:
Enzyme
Mol. Mass.:
83057.83
Organism:
Neosartorya fumigata (Aspergillus fumigatus)
Description:
Q873Y0
Residue:
825
  
Inhibitor
Name:
BDBM50331836
Synonyms:
5-acetamido-1,3,4-thiadiazole | CHEMBL1288808
Type:
Small organic molecule
Emp. Form.:
C4H5N3OS
Mol. Mass.:
143.167
SMILES:
CC(=O)Nc1nncs1
: