Target
Endochitinase
Ligand
BDBM39302
Substrate
Meas. Tech.
ChEMBL_686887 (CHEMBL1291256)
Ki
3200±n/a nM
Citation
 Schüttelkopf, AWGros, LBlair, DEFrearson, JAvan Aalten, DMGilbert, IH Acetazolamide-based fungal chitinase inhibitors. Bioorg Med Chem 18:8334-40 (2010)  
Target
Name:
Endochitinase
Synonyms:
CHIT_YEAST SCW2 | Soluble cell wall protein 2
Type:
PROTEIN
Mol. Mass.:
58992.99
Organism:
Saccharomyces cerevisiae
Description:
ChEMBL_686887
Residue:
562
  
Inhibitor
Name:
BDBM39302
Synonyms:
CHEMBL228792 N-(2-furanylmethyl)-7H-purin-6-amine N-(furan-2-ylmethyl)-9H-purin-6-amine cid_3830 | kinetin
Type:
Small organic molecule
Emp. Form.:
C10H9N5O
Mol. Mass.:
215.2114
SMILES:
C(Nc1ncnc2nc[nH]c12)c1ccco1
: