Target
Zn finger protein
Ligand
BDBM50332033
Substrate
Meas. Tech.
ChEMBL_687568 (CHEMBL1290840)
Ki
>100000±n/a nM
Citation
 Maresca, AScozzafava, ASupuran, CT 7,8-disubstituted- but not 6,7-disubstituted coumarins selectively inhibit the transmembrane, tumor-associated carbonic anhydrase isoforms IX and XII over the cytosolic ones I and II in the low nanomolar/subnanomolar range. Bioorg Med Chem Lett 20:7255-8 (2010)  
Target
Name:
Zn finger protein
Synonyms:
Type:
PROTEIN
Mol. Mass.:
25827.13
Organism:
Nicotiana tabacum
Description:
ChEMBL_687568
Residue:
234
  
Inhibitor
Name:
BDBM50332033
Synonyms:
6-Acetyl-7-hydroxy-2H-chromen-2-one | CHEMBL1288534
Type:
Small organic molecule
Emp. Form.:
C11H8O4
Mol. Mass.:
204.1788
SMILES:
CC(=O)c1cc2ccc(=O)oc2cc1O
: