Target
Zn finger protein
Ligand
BDBM50332034
Substrate
Meas. Tech.
ChEMBL_687568 (CHEMBL1290840)
Ki
>100000±n/a nM
Citation
 Maresca, AScozzafava, ASupuran, CT 7,8-disubstituted- but not 6,7-disubstituted coumarins selectively inhibit the transmembrane, tumor-associated carbonic anhydrase isoforms IX and XII over the cytosolic ones I and II in the low nanomolar/subnanomolar range. Bioorg Med Chem Lett 20:7255-8 (2010)  
Target
Name:
Zn finger protein
Synonyms:
Type:
PROTEIN
Mol. Mass.:
25827.13
Organism:
Nicotiana tabacum
Description:
ChEMBL_687568
Residue:
234
  
Inhibitor
Name:
BDBM50332034
Synonyms:
7-hydroxy-6-propionyl-2H-chromen-2-one | CHEMBL1288535
Type:
Small organic molecule
Emp. Form.:
C12H10O4
Mol. Mass.:
218.2054
SMILES:
CCC(=O)c1cc2ccc(=O)oc2cc1O
: