Target
Acetyl-CoA carboxylase 2
Ligand
BDBM97622
Substrate
Meas. Tech.
ChEMBL_695121 (CHEMBL1640869)
IC50
80±n/a nM
Citation
 Keil, SMüller, MZoller, GHaschke, GSchroeter, KGlien, MRuf, SFocken, IHerling, AWSchmoll, D Identification and synthesis of novel inhibitors of acetyl-CoA carboxylase with in vitro and in vivo efficacy on fat oxidation. J Med Chem 53:8679-87 (2010)  
Target
Name:
Acetyl-CoA carboxylase 2
Synonyms:
ACACB ACC-beta ACCB Acetyl-CoA carboxylase 2 Acetyl-CoA carboxylase 2 (ACC2)
Type:
Protein
Mol. Mass.:
276535.21
Organism:
Homo sapiens (Human)
Description:
O00763
Residue:
2458
  
Inhibitor
Name:
BDBM97622
Synonyms:
CHEMBL1630701 | US8470841, 51
Type:
Small organic molecule
Emp. Form.:
C22H28N2O3
Mol. Mass.:
368.4693
SMILES:
CC(C)Oc1ccc(Oc2ccc(CC[C@H](C)NC(=O)C3CC3)cc2)cn1
: