Target
Aldehyde oxidase 1
Ligand
BDBM24778
Substrate
Meas. Tech.
ChEMBL_696368 (CHEMBL1640081)
IC50
2000±n/a nM
Citation
 Pryde, DCDalvie, DHu, QJones, PObach, RSTran, TD Aldehyde oxidase: an enzyme of emerging importance in drug discovery. J Med Chem 53:8441-60 (2010)  
Target
Name:
Aldehyde oxidase 1
Synonyms:
AO AOXA_RABIT Retinal oxidase
Type:
PROTEIN
Mol. Mass.:
147140.36
Organism:
Oryctolagus cuniculus
Description:
ChEMBL_696368
Residue:
1334
  
Inhibitor
Name:
BDBM24778
Synonyms:
2-methyl-1,4-dihydronaphthalene-1,4-dione CHEMBL590 Menadione (5d) Menadione, 9 cid_4055
Type:
Small organic molecule
Emp. Form.:
C11H8O2
Mol. Mass.:
172.18
SMILES:
CC1=CC(=O)c2ccccc2C1=O
: