Target
Cytochrome P450 2B6
Ligand
BDBM50333117
Substrate
Meas. Tech.
ChEMBL_690369 (CHEMBL1634986)
IC50
3700±n/a nM
Citation
 Jeong, SNguyen, PDDesta, Z Comprehensive in vitro analysis of voriconazole inhibition of eight cytochrome P450 (CYP) enzymes: major effect on CYPs 2B6, 2C9, 2C19, and 3A. Antimicrob Agents Chemother 53:541-51 (2009)  
Target
Name:
Cytochrome P450 2B6
Synonyms:
CP2B6_HUMAN Cytochrome P450 2B6 (CYP2B6)
Type:
Protein
Mol. Mass.:
56289.75
Organism:
Homo sapiens (Human)
Description:
P20813
Residue:
491
  
Inhibitor
Name:
BDBM50333117
Synonyms:
(2R,3S)-2,3-bis(2,4-difluorophenyl)-1-(1H-1,2,4-triazol-1-yl)butan-2-ol (2R,3S)-2-(2,4-difluorophenyl)-3-(5-fluoropyrimidin-4-yl)-1-(1H-1,2,4-triazol-1-yl)butan-2-ol UK-109496 US9221791, Voriconazole Vfend
Type:
Small organic molecule
Emp. Form.:
C16H14F3N5O
Mol. Mass.:
349.3105
SMILES:
C[C@@H](c1ncncc1F)[C@](O)(Cn1cncn1)c1ccc(F)cc1F
: