Target
Beta-secretase 1
Ligand
BDBM50333392
Substrate
Meas. Tech.
ChEMBL_698692 (CHEMBL1648256)
IC50
3000±n/a nM
Citation
 Wångsell, FNordeman, PSävmarker, JEmanuelsson, RJansson, KLindberg, JRosenquist, SSamuelsson, BLarhed, M Investigation ofa-phenylnorstatine anda-benzylnorstatine as transition state isostere motifs in the search for new BACE-1 inhibitors. Bioorg Med Chem 19:145-55 (2011)  
Target
Name:
Beta-secretase 1
Synonyms:
ASP2 Aspartyl protease 2 BACE1 Beta-secretase (BACE) Beta-secretase 1 (BACE 1) Beta-secretase 1 (BACE1) Beta-site amyloid precursor protein cleaving enzyme 1 Memapsin-2 beta-Secretase (BACE-1) | beta-Secretase (BACE1)
Type:
Protein
Mol. Mass.:
55755.10
Organism:
Homo sapiens (Human)
Description:
P56817
Residue:
501
  
Inhibitor
Name:
BDBM50333392
Synonyms:
3-{3-[(S)-2-((S)-2-{(S)-2-Amino-3-[(2H-tetrazole-5-carbonyl)-amino]-propionylamino}-3-methyl-butyrylamino)-3-methyl-butyrylamino]-2-hydroxy-propionylamino}-benzoic acid | CHEMBL1645518
Type:
Small organic molecule
Emp. Form.:
C25H36N10O8
Mol. Mass.:
604.6155
SMILES:
CC(C)[C@H](NC(=O)[C@@H](NC(=O)[C@@H](N)CNC(=O)c1nnn[nH]1)C(C)C)C(=O)NCC(O)C(=O)Nc1cccc(c1)C(O)=O
: