Target
Sucrase-isomaltase, intestinal
Ligand
BDBM50263044
Substrate
Meas. Tech.
ChEMBL_698925 (CHEMBL1645865)
IC50
370±n/a nM
Citation
 Natori, YImahori, TMurakami, KYoshimura, YNakagawa, SKato, AAdachi, ITakahata, H The synthesis and biological evaluation of 1-C-alkyl-L-arabinoiminofuranoses, a novel class ofa-glucosidase inhibitors. Bioorg Med Chem Lett 21:738-41 (2011)  
Target
Name:
Sucrase-isomaltase, intestinal
Synonyms:
SUIS_RAT Sucrase-isomaltase | alpha-Glucosidase (α-Glucosidase)
Type:
Enzyme
Mol. Mass.:
210329.04
Organism:
Rattus norvegicus (Rat)
Description:
P23739
Residue:
1841
  
Inhibitor
Name:
BDBM50263044
Synonyms:
CHEMBL476960 | Voglibose
Type:
Small organic molecule
Emp. Form.:
C10H21NO7
Mol. Mass.:
267.2762
SMILES:
OCC(CO)N[C@H]1C[C@](O)(CO)[C@@H](O)[C@H](O)[C@H]1O
: