Target
Cathepsin D
Ligand
BDBM50333944
Substrate
Meas. Tech.
ChEMBL_700285 (CHEMBL1647503)
Ki
13±n/a nM
Citation
 Sund, CBelda, OWiktelius, DSahlberg, CVrang, LSedig, SHamelink, EHenderson, IAgback, TJansson, KBorkakoti, NDerbyshire, DEneroth, ASamuelsson, B Design and synthesis of potent macrocyclic renin inhibitors. Bioorg Med Chem Lett 21:358-62 (2010)  
Target
Name:
Cathepsin D
Synonyms:
CATD_HUMAN CTSD Cathepsin D heavy chain Cathepsin D precursor
Type:
Enzyme
Mol. Mass.:
44551.72
Organism:
Homo sapiens (Human)
Description:
Human proCathepsin D (SwissProt accession number P07339) was expressed in Sf9 cells, purified, and autoactivated.
Residue:
412
  
Inhibitor
Name:
BDBM50333944
Synonyms:
(S)-N-((S)-Benzylcarbamoyl-isopropylsulfanyl-methyl)-2-{(S)-2-hydroxy-2-[(S)-18-(methanesulfonyl-methyl-amino)-4-methyl-2,15-dioxo-11-oxa-3,14-diaza-tricyclo[14.3.1.1*5,9*]henicosa-1(20),5,7,9(21),16,18-hexaen-13-yl]-ethyl}-3-methyl-butyramide | CHEMBL1644462
Type:
Small organic molecule
Emp. Form.:
C40H53N5O8S2
Mol. Mass.:
796.008
SMILES:
CC(C)S[C@H](NC(=O)[C@@H](C[C@H](O)[C@@H]1COCc2cccc(c2)C(C)NC(=O)c2cc(cc(c2)C(=O)N1)N(C)S(C)(=O)=O)C(C)C)C(=O)NCc1ccccc1
: