Target
Glycogen phosphorylase, muscle form
Ligand
BDBM10849
Substrate
Meas. Tech.
ChEMBL_698031 (CHEMBL1645782)
IC50
75300±n/a nM
Citation
 Zhang, PXu, LQian, KLiu, JZhang, LLee, KHSun, H Efficient synthesis and biological evaluation of epiceanothic acid and related compounds. Bioorg Med Chem Lett 21:338-41 (2010)  
Target
Name:
Glycogen phosphorylase, muscle form
Synonyms:
Glycogen Phosphorylase (PYGM) Glycogen phosphorylase, muscle form PYGM | PYGM_RABIT
Type:
Enzyme
Mol. Mass.:
97296.32
Organism:
Oryctolagus cuniculus (rabbit)
Description:
Phosphorylation of Ser-15 converts phosphorylase B (unphosphorylated) to phosphorylase A.
Residue:
843
  
Inhibitor
Name:
BDBM10849
Synonyms:
1,3,7-trimethyl-2,3,6,7-tetrahydro-1H-purine-2,6-dione CHEMBL113 caffeine
Type:
Small organic molecule
Emp. Form.:
C8H10N4O2
Mol. Mass.:
194.1906
SMILES:
Cn1cnc2n(C)c(=O)n(C)c(=O)c12
: