Target
Beta-lactamase
Ligand
BDBM50021954
Substrate
Meas. Tech.
ChEMBL_703758 (CHEMBL1657726)
IC50
7758±n/a nM
Citation
 Beceiro, APérez, AFernández-Cuenca, FMartínez-Martínez, LPascual, AVila, JRodríguez-Baño, JCisneros, JMPachón, JBou, G Genetic variability among ampC genes from acinetobacter genomic species 3. Antimicrob Agents Chemother 53:1177-84 (2009)  
Target
Name:
Beta-lactamase
Synonyms:
ADC-16 protein
Type:
PROTEIN
Mol. Mass.:
43150.78
Organism:
Acinetobacter genomosp. 3
Description:
ChEMBL_703758
Residue:
383
  
Inhibitor
Name:
BDBM50021954
Synonyms:
(2S,5R)-3,3-Dimethyl-4,4,7-trioxo-4lambda*6*-thia-1-aza-bicyclo[3.2.0]heptane-2-carboxylic acid 3,3-Dimethyl-4,4,7-trioxo-4lambda*6*-thia-1-aza-bicyclo[3.2.0]heptane-2-carboxylic acid CHEMBL403 SULBACTAM US20230322715, Compound ALK-09 | US9120808, Sulbactam sodium salt
Type:
Small organic molecule
Emp. Form.:
C8H11NO5S
Mol. Mass.:
233.242
SMILES:
CC1(C)[C@@H](N2[C@@H](CC2=O)S1(=O)=O)C(O)=O
: