Target
D(2) dopamine receptor
Ligand
BDBM50064946
Substrate
Meas. Tech.
ChEMBL_714960 (CHEMBL1663955)
Ki
232±n/a nM
Citation
 Marrazzo, AFiorito, JZappalà, LPrezzavento, ORonsisvalle, SPasquinucci, LScoto, GMBernardini, RRonsisvalle, G Antiproliferative activity of phenylbutyrate ester of haloperidol metabolite II [(±)-MRJF4] in prostate cancer cells. Eur J Med Chem 46:433-8 (2010)  
Target
Name:
D(2) dopamine receptor
Synonyms:
DOPAMINE D2 DOPAMINE D2 Short Dopamine D2 receptor Drd2
Type:
G Protein-Coupled Receptor (GPCR)
Mol. Mass.:
50931.60
Organism:
Rattus norvegicus (rat)
Description:
P61169
Residue:
444
  
Inhibitor
Name:
BDBM50064946
Synonyms:
4-(4-Chloro-phenyl)-1-[4-(4-fluoro-phenyl)-4-hydroxy-butyl]-piperidin-4-ol Hydroxyhaloperidol
Type:
Small organic molecule
Emp. Form.:
C21H25ClFNO2
Mol. Mass.:
377.88
SMILES:
OC(CCCN1CCC(O)(CC1)c1ccc(Cl)cc1)c1ccc(F)cc1
: