Target
Type-1 angiotensin II receptor
Ligand
BDBM50318907
Substrate
Meas. Tech.
ChEMBL_717451 (CHEMBL1670350)
IC50
200±n/a nM
Citation
 Naik, PMurumkar, PGiridhar, RYadav, MR Angiotensin II receptor type 1 (AT1) selective nonpeptidic antagonists--a perspective. Bioorg Med Chem 18:8418-56 (2010)  
Target
Name:
Type-1 angiotensin II receptor
Synonyms:
AGTR1 ANGIOTENSIN AT1 Angiotensin II type 1a (AT-1a) receptor
Type:
Enzyme Catalytic Domain
Mol. Mass.:
41009.15
Organism:
RABBIT
Description:
ANGIOTENSIN AT1 AGTR1 RABBIT::P34976
Residue:
359
  
Inhibitor
Name:
BDBM50318907
Synonyms:
2-Ethoxy-3-[2'-(1H-tetrazol-5-yl)-biphenyl-4-ylmethyl]-3H-benzoimidazole-4-carboxylic acid 1-cyclohexyloxycarbonyloxy-ethyl ester Amias Blopress CHEMBL1014 Kenzen TCV-116 | candesartancilexetil
Type:
Small organic molecule
Emp. Form.:
C33H34N6O6
Mol. Mass.:
610.6597
SMILES:
CCOc1nc2cccc(C(=O)OC(C)OC(=O)OC3CCCCC3)c2n1Cc1ccc(cc1)-c1ccccc1-c1nnn[nH]1
: