Target
Lactoylglutathione lyase
Ligand
BDBM50012899
Substrate
Meas. Tech.
ChEMBL_716549 (CHEMBL1670273)
Ki
77900±n/a nM
Citation
 Yuan, MLuo, MSong, YXu, QWang, XCao, YBu, XRen, YHu, X Identification of curcumin derivatives as human glyoxalase I inhibitors: A combination of biological evaluation, molecular docking, 3D-QSAR and molecular dynamics simulation studies. Bioorg Med Chem 19:1189-96 (2011)  
Target
Name:
Lactoylglutathione lyase
Synonyms:
Aldoketomutase Glx I Glyoxalase I LGUL_HUMAN S-D-lactoylglutathione methylglyoxal lyase
Type:
Enzyme
Mol. Mass.:
20772.95
Organism:
Homo sapiens (Human)
Description:
Q04760
Residue:
184
  
Inhibitor
Name:
BDBM50012899
Synonyms:
(Z)-5-Fluoro-2-methyl-1-((p-(methylsulfinyl)phenyl)methylene)-1H-indene-3-acetic acid SULINDAC cis-5-Fluoro-2-methyl-1-((p-methylsulfinyl)benzylidene)indene-3-acetic acid | {(1Z)-5-fluoro-2-methyl-1-[4-(methylsulfinyl)benzylidene]-1H-inden-3-yl}acetic acid
Type:
Small organic molecule
Emp. Form.:
C20H17FO3S
Mol. Mass.:
356.411
SMILES:
CC1=C(CC(O)=O)c2cc(F)ccc2\C1=C/c1ccc(cc1)S(C)=O
: