Target
Serine/threonine-protein kinase mTOR
Ligand
BDBM50336412
Substrate
Meas. Tech.
ChEMBL_716817 (CHEMBL1670739)
Ki
13±n/a nM
Citation
 Liu, KKHuang, XBagrodia, SChen, JHGreasley, SCheng, HSun, SKnighton, DRodgers, CRafidi, KZou, AXiao, JYan, S Quinazolines with intra-molecular hydrogen bonding scaffold (iMHBS) as PI3K/mTOR dual inhibitors. Bioorg Med Chem Lett 21:1270-4 (2011)  
Target
Name:
Serine/threonine-protein kinase mTOR
Synonyms:
FK506-binding protein 12-rapamycin complex-associated protein 1 FRAP FRAP1 MTOR Mammalian Target of Rapamycin (mTOR) RAFT1 Rapamycin and FKBP12 target 1 Serine/threonine-protein kinase (mTOR) | mTORC2
Type:
Rapamycin target protein
Mol. Mass.:
288917.12
Organism:
Homo sapiens (Human)
Description:
P42345
Residue:
2549
  
Inhibitor
Name:
BDBM50336412
Synonyms:
4-amino-2-methyl-6-(morpholinomethyl)-N-(1H-pyrazol-5-yl)quinazoline-8-carboxamide | CHEMBL1668267
Type:
Small organic molecule
Emp. Form.:
C18H21N7O2
Mol. Mass.:
367.405
SMILES:
Cc1nc(N)c2cc(CN3CCOCC3)cc(C(=O)Nc3ccn[nH]3)c2n1
: