Target
Translocator protein
Ligand
BDBM50336501
Substrate
Meas. Tech.
ChEMBL_720286 (CHEMBL1679152)
IC50
>30000000±n/a nM
Citation
 Nyanguile, OPauwels, FVan den Broeck, WBoutton, CWQuirynen, LIvens, Tvan der Helm, LVandercruyssen, GMostmans, WDelouvroy, FDehertogh, PCummings, MDBonfanti, JFSimmen, KARaboisson, P 1,5-benzodiazepines, a novel class of hepatitis C virus polymerase nonnucleoside inhibitors. Antimicrob Agents Chemother 52:4420-31 (2008)  
Target
Name:
Translocator protein
Synonyms:
BZRP Mitochondrial benzodiazepine receptor PKBS Peripheral-type benzodiazepine receptor TSPO_HUMAN
Type:
Enzyme
Mol. Mass.:
18834.74
Organism:
Homo sapiens (Human)
Description:
P30536
Residue:
169
  
Inhibitor
Name:
BDBM50336501
Synonyms:
10-acetyl-11-(4-(benzyloxy)-2-chlorophenyl)-6-hydroxy-3,3-dimethyl-2,3,4,5,10,11-hexahydro-1H-dibenzo[b,e][1,4]diazepin-1-one | CHEMBL512949
Type:
Small organic molecule
Emp. Form.:
C30H29ClN2O4
Mol. Mass.:
517.015
SMILES:
CC(=O)N1C(C2C(=O)CC(C)(C)CC2=Nc2c(O)cccc12)c1ccc(OCc2ccccc2)cc1Cl
: