Target
Lanosterol 14-alpha demethylase
Ligand
BDBM25817
Substrate
Meas. Tech.
ChEMBL_721239 (CHEMBL1675116)
Kd
200±n/a nM
Citation
 Warrilow, AGJackson, CJParker, JEMarczylo, THKelly, DELamb, DCKelly, SL Identification, characterization, and azole-binding properties of Mycobacterium smegmatis CYP164A2, a homolog of ML2088, the sole cytochrome P450 gene of Mycobacterium leprae. Antimicrob Agents Chemother 53:1157-64 (2009)  
Target
Name:
Lanosterol 14-alpha demethylase
Synonyms:
CP51_MYCTO Cytochrome P450 51(CYP51) P450-LIA1 cyp51
Type:
Monooxygenase; oxidoreductase
Mol. Mass.:
50869.67
Organism:
Mycobacterium tuberculosis (strain CDC 1551 / Oshkosh)
Description:
P9WPP8
Residue:
451
  
Inhibitor
Name:
BDBM25817
Synonyms:
2-(2,4-difluorophenyl)-1,3-bis(1H-1,2,4-triazol-1-yl)propan-2-ol Diflucan Fluconazole (f) Triflucan US11247981, Example Fluconazole US9144538, Fluconazole US9556143, Fluconazole | cid_3365
Type:
Small organic molecule
Emp. Form.:
C13H12F2N6O
Mol. Mass.:
306.2708
SMILES:
OC(Cn1cncn1)(Cn1cncn1)c1ccc(F)cc1F
: