Target
Progesterone receptor
Ligand
BDBM50336931
Substrate
Meas. Tech.
ChEMBL_718592 (CHEMBL1680618)
Ki
0.214±n/a nM
Citation
 Richardson, TIClarke, CAYu, KLYee, YKBleisch, TJLopez, JEJones, SAHughes, NEMuehl, BSLugar, CWMoore, TLShetler, PKZink, RWOsborne, JJMontrose-Rafizadeh, CPatel, NGeiser, AGGalvin, RJ Novel 3-Aryl Indoles as Progesterone Receptor Antagonists for Uterine Fibroids ACS Med Chem Lett 2:148-153 (2011)  
Target
Name:
Progesterone receptor
Synonyms:
NR3C3 PGR PRGR_HUMAN | progesterone
Type:
Protein
Mol. Mass.:
98979.52
Organism:
Homo sapiens (Human)
Description:
P06401
Residue:
933
  
Inhibitor
Name:
BDBM50336931
Synonyms:
CHEMBL1672547 | N-(3-(4-cyano-3-fluorophenyl)-1-isopropyl-1H-indol-6-yl)methanesulfonamide
Type:
Small organic molecule
Emp. Form.:
C19H18FN3O2S
Mol. Mass.:
371.429
SMILES:
CC(C)n1cc(-c2ccc(C#N)c(F)c2)c2ccc(NS(C)(=O)=O)cc12
: