Target
Adenosine receptor A2b
Ligand
BDBM50336996
Substrate
Meas. Tech.
ChEMBL_719009 (CHEMBL1679071)
Ki
0.600000±n/a nM
Citation
 Eastwood, PEsteve, CGonzález, JFonquerna, SAiguadé, JCarranco, IsDoménech, TAparici, MsMiralpeix, MAlbertí, JCórdoba, MFernández, RPont, MsGodessart, NsPrats, NLoza, MsCadavid, MsNueda, A Discovery of LAS101057: A Potent, Selective, and Orally Efficacious A2B Adenosine Receptor Antagonist ACS Med Chem Lett 2:213-218 (2011)  
Target
Name:
Adenosine receptor A2b
Synonyms:
AA2BR_HUMAN ADORA2B Adenosine receptors A2b | Adenosine receptors; A2a & A2b
Type:
G Protein-Coupled Receptor (GPCR)
Mol. Mass.:
36341.22
Organism:
Homo sapiens (Human)
Description:
Residue:
332
  
Inhibitor
Name:
BDBM50336996
Synonyms:
CHEMBL1672631 | N-[6-(2-Fluorophenyl)-5-(3-fluoropyridin-4-yl)pyrazin-2-yl]cyclopropane-carboxamide
Type:
Small organic molecule
Emp. Form.:
C19H14F2N4O
Mol. Mass.:
352.3375
SMILES:
Fc1ccccc1-c1nc(NC(=O)C2CC2)cnc1-c1ccncc1F
: