Target
Acetylcholinesterase
Ligand
BDBM50262988
Substrate
Meas. Tech.
ChEMBL_739677 (CHEMBL1763503)
Ki
6±n/a nM
Citation
 Komloova, MMusilek, KHorova, AHolas, ODohnal, VGunn-Moore, FKuca, K Preparation, in vitro screening and molecular modelling of symmetrical bis-quinolinium cholinesterase inhibitors--implications for early myasthenia gravis treatment. Bioorg Med Chem Lett 21:2505-9 (2011)  
Target
Name:
Acetylcholinesterase
Synonyms:
ACES_HUMAN Acetylcholinesterase (AChE) | Acetylcholinesterase (human AChE)
Type:
Enzyme
Mol. Mass.:
67792.70
Organism:
Homo sapiens (Human)
Description:
P22303
Residue:
614
  
Inhibitor
Name:
BDBM50262988
Synonyms:
CHEMBL1200541 ambenonium
Type:
Small organic molecule
Emp. Form.:
C28H42Cl2N4O2
Mol. Mass.:
537.564
SMILES:
CC[N+](CC)(CCNC(=O)C(=O)NCC[N+](CC)(CC)Cc1ccccc1Cl)Cc1ccccc1Cl
: