Target
11-beta-hydroxysteroid dehydrogenase 1
Ligand
BDBM50340392
Substrate
Meas. Tech.
ChEMBL_740937 (CHEMBL1764081)
IC50
1.5±n/a nM
Citation
 Maletic, MLeeman, ASzymonifka, MMundt, SSZokian, HJShah, KDragovic, JLyons, KThieringer, RVosatka, AHBalkovec, JWaddell, ST Bicyclo[2.2.2]octyltriazole inhibitors of 11β-hydoxysteroid dehydrogenase type 1. Pharmacological agents for the treatment of metabolic syndrome. Bioorg Med Chem Lett 21:2568-72 (2011)  
Target
Name:
11-beta-hydroxysteroid dehydrogenase 1
Synonyms:
11-DH 11-beta-Hydroxysteroid Dehydrogenase 1 (11-beta-HSD1) 11beta-HSD1A Corticosteroid 11-beta-dehydrogenase isozyme 1 (11-beta-HSD-1) Hsd11 | Hsd11b1
Type:
Enzyme
Mol. Mass.:
32369.70
Organism:
Mus musculus (mouse)
Description:
P50172
Residue:
292
  
Inhibitor
Name:
BDBM50340392
Synonyms:
4-methyl-3-(4-(2-(2,2,2-trifluoroethylsulfonyl)ethyl)bicyclo[2.2.2]octan-1-yl)-5-(2-(trifluoromethyl)phenyl)-4H-1,2,4-triazole | CHEMBL1761320
Type:
Small organic molecule
Emp. Form.:
C22H25F6N3O2S
Mol. Mass.:
509.508
SMILES:
Cn1c(nnc1C12CCC(CCS(=O)(=O)CC(F)(F)F)(CC1)CC2)-c1ccccc1C(F)(F)F
: