Target
11-beta-hydroxysteroid dehydrogenase 1
Ligand
BDBM50340396
Substrate
Meas. Tech.
ChEMBL_740937 (CHEMBL1764081)
IC50
1.7±n/a nM
Citation
 Maletic, MLeeman, ASzymonifka, MMundt, SSZokian, HJShah, KDragovic, JLyons, KThieringer, RVosatka, AHBalkovec, JWaddell, ST Bicyclo[2.2.2]octyltriazole inhibitors of 11β-hydoxysteroid dehydrogenase type 1. Pharmacological agents for the treatment of metabolic syndrome. Bioorg Med Chem Lett 21:2568-72 (2011)  
Target
Name:
11-beta-hydroxysteroid dehydrogenase 1
Synonyms:
11-DH 11-beta-Hydroxysteroid Dehydrogenase 1 (11-beta-HSD1) 11beta-HSD1A Corticosteroid 11-beta-dehydrogenase isozyme 1 (11-beta-HSD-1) Hsd11 | Hsd11b1
Type:
Enzyme
Mol. Mass.:
32369.70
Organism:
Mus musculus (mouse)
Description:
P50172
Residue:
292
  
Inhibitor
Name:
BDBM50340396
Synonyms:
5-(4-(4-methyl-5-(2-(trifluoromethyl)phenyl)-4H-1,2,4-triazol-3-yl)bicyclo[2.2.2]octan-1-yl)pentan-2-ol | CHEMBL1761136
Type:
Small organic molecule
Emp. Form.:
C23H30F3N3O
Mol. Mass.:
421.499
SMILES:
CC(O)CCCC12CCC(CC1)(CC2)c1nnc(-c2ccccc2C(F)(F)F)n1C
: